{"text_format":"1","workbook":"xlsx","n_sheets":5,"sheets":["Materjal","Masinad","Tööde arvutus","GWP","Projekteerimise arvutus"],"not_rendered":{"charts":0,"images":2,"macros":0,"external_links":1,"defined_names":20,"comments":0,"pivot_tables":0},"unopened":[],"bounds":{"document_bytes":16777216,"sheet_cells":100000,"rows_first":2000,"rows_last":500,"rows_between":2000,"halvings":0,"cell_chars":16384,"cell_head_chars":4096},"cells_cut":0,"cells_raw":0,"read":"whole","date_system":"1900"}

{"sheet":"Materjal","index":0,"n_rows":134,"n_cols":21,"rows_kept":134,"cut":false,"hidden":false,"merged":[]}
["EPD","Nimetus","Ühik","GWP, kg/kg","Hind"]
["Kütused"]
[null,"Maagaas","m³",1.881,0.5]
[null,"Biogaas","m³",1.1138132008417778E-3,1.4]
[null,"Biodiisel FAME","L",0.14799999999999999,1.5]
[null,"Biodiisel HVO","L",3.0000000000000001E-3,1.3]
[null,"Biodiisel ME","L",1.7999999999999999E-2,2]
[null,"Diisel","L",2.6137418226894042,1.1000000000000001]
[null,"Bensiin","L",2.2469999999999999,1.2]
[null,"PKÕ","kg",3.1349630787699354,0.7]
[null,"Elekter","kWh",0.4,0.19]
[]
[]
[]
[]
[]
["Asfaltsegud"]
[null,"SMA","kg",{"$f":"68/1000","v":6.8000000000000005E-2}]
[null,"AC surf","kg",{"$f":"65/1000","v":6.5000000000000002E-2}]
[null,"AC bin","kg",{"$f":"44/1000","v":4.3999999999999997E-2}]
[null,"AC base","kg",{"$f":"35/1000","v":3.5000000000000003E-2}]
[null,"MA","kg",{"$f":"76/1000","v":7.5999999999999998E-2}]
[null,"PA","kg",{"$f":"46/1000","v":4.5999999999999999E-2}]
[null,"Filler, peentäitematerjal","kg",{"$f":"7.4/1000","v":7.4000000000000003E-3}]
[]
["Asfalt materjalid"]
[null,"Tardkivikillustik,ridamaterjal","kg",{"$f":"11.7/1000","v":1.1699999999999999E-2},23]
[null,"Tardkivikillustik, fraktsineeritud","kg",{"$f":"11.7/1000","v":1.1699999999999999E-2},23,null,null,null,null,null,null,null,null,null,null,null,null,null,null,"Ter tihedus"]
[null,"Tardkivikillustik, purustatud","kg",1.1699999999999999E-2,23,null,6.3E-2,0.125,0.25,0.5,1,2,4,6.3,8,12,16,20,32]
[null,"Tardkivikillustik, TAU10/20","kg",1.1699999999999999E-2,25,null,1,1,1,1,2,2,2,3,20,81.666666666666671,80,95,100,2.69]
[null,"Tardkivikillustik, TAU 8/16","kg",1.1699999999999999E-2,26,null,1,1,1,1,1,2,5,20,40,60,90,100,{"$error":"#N/A"},2.68]
[null,"Tardkivikillustik, TAU 6/12","kg",1.1699999999999999E-2,26,null,1,1,1,1,1,2,8,30,60,95,100,{"$error":"#N/A"},{"$error":"#N/A"},2.68]
[null,"Tardkivikillustik, TAU 4/8","kg",1.1699999999999999E-2,27,null,1,1,1,1,2,2,30,60,90,100,{"$error":"#N/A"},{"$error":"#N/A"},{"$error":"#N/A"},2.91]
[null,"Tardkivikillustik, TAU 2/6","kg",1.1699999999999999E-2,26,null,1,1,1,1,5,30,60,90,100,{"$error":"#N/A"},{"$error":"#N/A"},{"$error":"#N/A"},{"$error":"#N/A"},2.69]
[null,"Tardkivikillustik, TAU 0/5","kg",1.1699999999999999E-2,16,null,8,20,30,50,60,70,88,100,{"$error":"#N/A"},{"$error":"#N/A"},{"$error":"#N/A"},{"$error":"#N/A"},{"$error":"#N/A"},2.76]
[]
[null,"Tardkivikillustik, INKOO 10/20","kg",1.1699999999999999E-2,25,null,1,1,1,1,2,2,2,3,20,81.666666666666671,80,95,100,2.69]
[null,"Tardkivikillustik, INKOO 8/16","kg",1.1699999999999999E-2,26,null,1,1,1,1,1,2,2,20,40,60,90,100,{"$error":"#N/A"},2.68]
[null,"Tardkivikillustik, INKOO 6/12","kg",1.1699999999999999E-2,26,null,1,1,1,1,1,2,4,30,65,95,100,{"$error":"#N/A"},{"$error":"#N/A"},2.68]
[null,"Tardkivikillustik, INKOO 4/8","kg",1.1699999999999999E-2,27,null,1,1,1,1,2,2,30,60,90,100,{"$error":"#N/A"},{"$error":"#N/A"},{"$error":"#N/A"},2.91]
[null,"Tardkivikillustik, INKOO 2/6","kg",1.1699999999999999E-2,26,null,1,1,1,1,5,30,60,95,100,{"$error":"#N/A"},{"$error":"#N/A"},{"$error":"#N/A"},{"$error":"#N/A"},2.69]
[null,"Tardkivikillustik, INKOO 0/5","kg",1.1699999999999999E-2,16,null,8,20,30,50,60,70,88,100,{"$error":"#N/A"},{"$error":"#N/A"},{"$error":"#N/A"},{"$error":"#N/A"},{"$error":"#N/A"},2.76]
[]
[null,"Pae, 16/32","kg",{"$f":"3.3/1000","v":3.3E-3},8,null,1,1,1,1,2,2,2,3,20,81.666666666666671,75,88,98,2.73]
[null,"Pae, 8/16","kg",{"$f":"3.3/1000","v":3.3E-3},9,null,1,1,1,1,1,2,2,20,40,60,90,100,{"$error":"#N/A"},2.73]
[null,"Pae, 8/12","kg",3.3E-3,9,null,1,1,1,1,1,2,4,30,65,95,100,{"$error":"#N/A"},{"$error":"#N/A"},2.73]
[null,"Pae, 4/16","kg",3.3E-3,9,null,1,1,1,1,1,2,30,40,60,75,95,{"$error":"#N/A"},{"$error":"#N/A"},2.73]
[null,"Pae, 4/12","kg",3.3E-3,9,null,1,1,1,1,1,2,30,60,80,95,100,{"$error":"#N/A"},{"$error":"#N/A"},2.73]
[null,"Pae, 4/8","kg",3.3E-3,9,null,1,1,1,1,2,2,30,60,90,100,{"$error":"#N/A"},{"$error":"#N/A"},{"$error":"#N/A"},2.73]
[null,"Pae, 0/5","kg",3.3E-3,7,null,8,20,30,50,60,70,88,100,{"$error":"#N/A"},{"$error":"#N/A"},{"$error":"#N/A"},{"$error":"#N/A"},{"$error":"#N/A"},2.76]
[null,"Paekivi, fraktsioneeritud","kg",3.3E-3,8]
[null,"Paekivi, fraktsioneerimata","kg",3.3E-3,6]
["Liivad ja kruusad"]
[null,"Looduslik liiv","kg",{"$f":"1.7/1000","v":1.6999999999999999E-3},3.5]
[null,"Pestud liiv","kg",{"$f":"1.7/1000","v":1.6999999999999999E-3},5]
[null,"Pumbatud liiv","kg",1.6999999999999999E-3,4]
[null,"Sõelutud liiv","kg",1.6999999999999999E-3,5,null,2,20,60,80,90,100,{"$error":"#N/A"},{"$error":"#N/A"},{"$error":"#N/A"},{"$error":"#N/A"},{"$error":"#N/A"},{"$error":"#N/A"},{"$error":"#N/A"},2.66]
[null,"Veealune liiv","kg",1.6999999999999999E-3,4.5]
[null,"1 karj._liiv","kg",1.6999999999999999E-3,4.0999999999999996,null,null,null,null,null,null,null,null,null,null,null,null,null,null,1.76]
[null,"2 karj._liiv","kg",1.6999999999999999E-3,5,null,null,null,null,null,null,null,null,null,null,null,null,null,null,1.72]
{"$rows_left_out":75}
{"sheet":"Masinad","index":1,"n_rows":177,"n_cols":17,"rows_kept":177,"cut":false,"hidden":false,"merged":[[37,0,41,0],[3,0,14,0],[15,0,17,0],[18,0,20,0],[21,0,30,0],[31,0,36,0],[123,0,130,0],[42,0,48,0],[49,0,59,0],[60,0,69,0],[70,0,77,0],[78,0,82,0],[83,0,89,0],[90,0,92,0],[93,0,103,0],[104,0,114,0],[115,0,118,0],[121,0,122,0],[159,0,163,0],[165,0,167,0],[135,0,136,0],[137,0,143,0],[144,0,145,0],[146,0,147,0],[148,0,152,0]]}
[]
["Masina tüüp","Mudel","Kaal","Võimsus","Tootlikus","Maht","Stage","Tunnis","Kasutegur"]
["Masinad"]
["Ekskavaator",302,2,15,{"$f":"F4*D4*0.53","v":0.79500000000000004},0.1,5,{"$f":"D4*I4*(0.6957*G4^-0.095)","v":4.746647507339457},0.53]
[null,305,5,40,6.36,0.3,5,12.657726686238554,0.53]
[null,308,8,50,10.600000000000001,0.4,5,15.822158357798189,0.53]
[null,313,12,60,19.080000000000002,0.6,5,18.986590029357828,0.53]
[null,316,14,70,24.115000000000002,0.65,5,22.151021700917468,0.53]
[null,318,17,80,31.8,0.75,5,25.315453372477108,0.53]
[null,320,21,100,48.230000000000004,0.91,5,31.644316715596378,0.53]
[null,326,25,158,102.1628,1.22,5,49.998020410642283,0.53]
[null,330,30,194,165.54020000000003,1.61,5,61.389974428256977,0.53]
[null,336,37,224,241.0016,2.0299999999999998,5,70.883269442935884,0.53]
[null,345,45,258,318.60419999999999,2.33,5,81.642337126238658,0.53]
[null,352,52,302,528.19799999999998,3.3,5,95.565836481101073,0.53]
["Ratasekskavaator","M314",15,93,4.9290000000000003,0.1,5,29.429214545504632,0.53]
[null,"M316",17,108,17.172000000000001,0.3,5,34.175862052844089,0.53]
[null,"M318",19.5,129,27.348000000000003,0.4,5,40.821168563119329,0.53]
["Kopplaadur",428,8.1999999999999993,52,27.560000000000002,1,5,16.455044692110118,0.53]
[null,432,9.8000000000000007,75,40.942500000000003,1.03,5,23.733237536697285,0.53]
[null,444,10.8,82,56.498000000000005,1.3,5,25.948339706789032,0.53]
["Frontaallaadur",906,5.7,55,20.405000000000001,0.7,5,17.404374193578011,0.53]
[null,910,8.1,73,46.427999999999997,1.2,5,23.100351202385358,0.53]
[null,926,12.7,127,141.351,2.1,5,40.188282228807402,0.53]
[null,938,16.100000000000001,143,159.15900000000002,2.1,5,45.251372903302823,0.53]
[null,950,19.600000000000001,186,325.31399999999996,3.3,5,58.858429091009263,0.53]
[null,962,20.5,202,385.41600000000005,3.6,5,63.921519765504691,0.53]
[null,966,24,222,{"$f":"F28*D28*0.53","v":470.64000000000004},4,5,70.250383108623964,0.53]
[null,980,31.3,293,885.15300000000013,5.7,5,92.717847976697399,0.53]
[null,988,51,432,1465.3440000000003,6.4,5,136.70344821137635,0.53]
[null,990,81,586,2670.9879999999998,8.6,5,185.4356959533948,0.53]
["Minilaadur",239,3.4,50.1,{"$f":"F32*0.53*D32","v":7.9659000000000004},0.3,5,15.853802674513787,0.53]
[null,255,4.3,55.4,{"$f":"F33*0.53*D33","v":11.744800000000001},0.4,5,17.530951460440395,0.53]
[null,275,5.6,91,{"$f":"F34*0.53*D34","v":21.221200000000003},0.44,5,28.796328211192709,0.53]
[null,"226D",2.7,51,8.109,0.3,5,16.138601524954154,0.53]
[null,"272D",4.3,82,17.384,0.4,5,25.948339706789032,0.53]
[null,"270D",4.9000000000000004,91,21.221200000000003,0.44,5,28.796328211192709,0.53]
["Dumper",725,24,255,{"$f":"D38*0.53*F38/C38","v":84.46875},15,5,80.693007624770772,0.53]
[null,730,28,280,{"$f":"D39*0.53*F39/C39","v":92.75},17.5,5,88.604086803669873,0.53]
[null,735,32,324,107.325,20,5,102.52758615853227,0.53]
[null,740,38,337,108.10605263157896,23,5,106.6413473315598,0.53]
[null,745,41,381,128.05317073170733,26,5,120.56484668642221,0.53]
["Traktor kallur","Kubota M6-111",{"$f":"4.6+7","v":11.6},81,37.008620689655174,10,5,25.631896539633068,0.53]
[null,"JCB FASTRAC 4220",{"$f":"11.1+7","v":18.100000000000001},{"$f":"235/1.343","v":174.98138495904692},51.237643109555172,10,5,55.371663649777737,0.53]
[null,"JCB FASTRAC 8330",{"$f":"11.1+7","v":18.100000000000001},{"$f":"348/1.343","v":259.12137006701414},75.87531830691573,10,5,81.99718702179851,0.53]
[null,"MF 6713",{"$f":"5.2+7","v":12.2},{"$f":"130/1.343","v":96.798212956068511},42.051682677636329,10,5,30.631133082855769,0.53]
[null,"MF 8735",{"$f":"10.8+7","v":17.8},{"$f":"300/1.343","v":223.38049143708116},66.512168798681458,10,5,70.687230191205614,0.53]
[null,null,null,null,null,null,5,0,0.53]
[null,null,null,null,null,null,5,0,0.53]
["Buldooser","D1",8.1,59.7,{"$f":"F50*60*0.53","v":73.14},2.2999999999999998,5,18.89165707921104,0.53]
[null,"D2",8.5,68.8,{"$f":"F51*60*0.53","v":82.68},2.6,5,21.771289900330309,0.53]
[null,"D3",9.4,77.599999999999994,{"$f":"F52*60*0.53","v":95.4},3,5,24.555989771302791,0.53]
[null,"D4",14,119,120.84,3.8,5,37.656736891559689,0.53]
[null,"D5",19.2,127,127.2,4,5,40.188282228807402,0.53]
[null,"D6",24,187,219.42000000000002,6.9,5,59.17487225816523,0.53]
[null,"D7",29.8,197,265.21199999999999,8.34,5,62.339303929724871,0.53]
[null,"D8",40,296,327.54000000000002,10.3,5,93.667177478165286,0.53]
[null,"D9",50,337,429.3,13.5,5,106.6413473315598,0.53]
[null,"D10",70.2,449,699.6,22,5,142.08298205302773,0.53]
[null,"D11",106.8,757,864.96,27.2,5,239.54747753706462,0.53]
{"$rows_left_out":118}
{"sheet":"Tööde arvutus","index":2,"n_rows":31,"n_cols":27,"rows_kept":31,"cut":false,"hidden":false,"merged":[]}
[null,null,"Stage","Euro",28,13]
[null,null,5,6,330,250]
[null,null,null,null,"kg CO2e ","Ühik"]
[null,"ID"]
["KS32",{"$f":"GWP!A138","v":41101},100000,15,{"$f":"F5/C5*1000","v":10.633042152045034},{"$f":"SUM(F10:F31)","v":1063.3042152045034},"1cm =",null,null,null,null,null,null,null,null,null,null,null,null,null,null,null,null,null,null,null,{"$f":"F5/C5/D5*1000","v":0.70886947680300227}]
[]
[]
[]
["Pae, 16/32",50,2.2999999999999998,{"$f":"C9*C5*D5/100/2","v":17249.999999999996},{"$f":"_xlfn.XLOOKUP(A9,Materjal!$B$2:$B$253,Materjal!$D$2:$D$253)*1000","v":3.3},{"$f":"D9*E9/1000","v":56.924999999999983}]
["RA objektil",5,2.2999999999999998,{"$f":"C10*C5*D5/100/2","v":17249.999999999996},{"$f":"_xlfn.XLOOKUP(A10,Materjal!$B$2:$B$253,Materjal!$D$2:$D$253)*1000","v":0},{"$f":"D10*E10/1000","v":0}]
["Tsement, Kunda CEM I 42.5R",50,2.5,{"$f":"(D10+D9)*C11/100","v":862.49999999999989},{"$f":"_xlfn.XLOOKUP(A11,Materjal!$B$2:$B$253,Materjal!$D$2:$D$253)*1000","v":721},{"$f":"D11*E11/1000","v":621.86249999999984}]
["Bit 70/100",370,1.5,{"$f":"(D9+D10)*C12/100","v":517.49999999999989},{"$f":"_xlfn.XLOOKUP(A12,Materjal!$B$2:$B$253,Materjal!$D$2:$D$253)*1000","v":530},274.27499999999992]
[{"$f":"$E$1","v":28},{"$f":"$E$2","v":330},{"$f":"D9","v":17249.999999999996},{"$f":"B9","v":50},{"$f":"((B13*\nIF(OR(ISTEXT(D13),D13<5),0.52,\n  IF(D13<50,MAX(-0.0014*D13+0.46,0.39),\n    IF(D13<=100,(-0.0014*D13+0.45),0.31)))\n*(0.6957*$D$2^-0.088)/(A13*80/2)))","v":6.6531023890834318E-2},{"$f":"C13*D13*E13/1000","v":57.383008105844588}]
[{"$f":"$E$1","v":28},{"$f":"$E$2","v":330},{"$f":"D10","v":17249.999999999996},{"$f":"B10","v":5},{"$f":"((B14*\nIF(OR(ISTEXT(D14),D14<5),0.52,\n  IF(D14<50,MAX(-0.0014*D14+0.46,0.39),\n    IF(D14<=100,(-0.0014*D14+0.45),0.31)))\n*(0.6957*$D$2^-0.088)/(A14*80/2)))","v":7.931198374354724E-2},{"$f":"C14*D14*E14/1000","v":6.8406585978809478}]
[{"$f":"$E$1","v":28},330,{"$f":"D11","v":862.49999999999989},{"$f":"B11","v":50},{"$f":"((B15*\nIF(OR(ISTEXT(D15),D15<5),0.52,\n  IF(D15<50,MAX(-0.0014*D15+0.46,0.39),\n    IF(D15<=100,(-0.0014*D15+0.45),0.31)))\n*(0.6957*$D$2^-0.088)/(A15*80/2)))","v":6.6531023890834318E-2},{"$f":"C15*D15*E15/1000","v":2.8691504052922294}]
[{"$f":"$E$1","v":28},330,{"$f":"D12","v":517.49999999999989},{"$f":"B12","v":370},5.4275308963575367E-2,10.392364783800591]
["Laadimine"]
["Ekskavaator",100,{"$f":"Masinad!$E$10","v":48.230000000000004},{"$f":"D9/C18","v":357.66120671781039},{"$f":"B18*0.53*(0.6957*$C$2^-0.095)","v":31.644316715596378},{"$f":"E18*D18/1000","v":11.317944502260779}]
["Frontaallaadur",159,{"$f":"Masinad!$E$25","v":159.15900000000002},{"$f":"D10/C19","v":108.38218385388193},{"$f":"B19*0.53*(0.6957*$C$2^-0.095)","v":50.31446357779825},{"$f":"E19*D19/1000","v":5.453191441998376}]
["Killustik"]
["Buldooser",127,{"$f":"Masinad!$E$54","v":127.2},{"$f":"D9/C21","v":135.61320754716979},{"$f":"B21*0.53*(0.6957*$C$2^-0.095)","v":40.188282228807402},{"$f":"E21*D21/1000","v":5.4500618588594936}]
["Pinnasetihendaja",119,{"$f":"Masinad!$E$76","v":264.89400000000001},{"$f":"D21","v":135.61320754716979},{"$f":"B22*0.53*(0.6957*$C$2^-0.095)","v":37.656736891559689},{"$f":"D22*E22/1000","v":5.1067508756242495}]
["RA"]
["Buldooser",127,{"$f":"Masinad!$E$54","v":127.2},{"$f":"D10/C10/C24","v":58.96226415094339},{"$f":"B24*0.53*(0.6957*$C$2^-0.095)","v":40.188282228807402},{"$f":"D24*E24/1000","v":2.3695921125476063}]
["Pinnasetihendaja",119,{"$f":"Masinad!$E$76","v":264.89400000000001},{"$f":"D24","v":58.96226415094339},{"$f":"B25*0.53*(0.6957*$C$2^-0.095)","v":37.656736891559689},{"$f":"D25*E25/1000","v":2.2203264676627175}]
["Segamine"]
["Tsemendi laoturid",97,{"$f":"Masinad!E92","v":24.199553239017128},{"$f":"D11/C27","v":35.641153846153841},{"$f":"B27*0.53*(0.6957*$C$2^-0.095)","v":30.694987214128489},{"$f":"D27*E27/1000","v":1.0940047616044786}]
["Stabilisaator",563,{"$f":"Masinad!$E$89","v":716.13600000000008},{"$f":"C5/C28","v":139.63828099690559},{"$f":"B28*0.53*(0.6957*$C$2^-0.095)","v":178.15750310880765},{"$f":"D28*E28/1000","v":24.877607480814763}]
["Greider",165,{"$f":"Masinad!$E$64","v":367.29000000000008},{"$f":"C5/C29","v":272.26442320781939},{"$f":"B29*0.53*(0.6957*$C$2^-0.095)","v":52.21312258073403},{"$f":"D29*E29/1000","v":14.215775703322722}]
["Pinnasetihendaja",119,{"$f":"Masinad!$E$76","v":264.89400000000001},{"$f":"C5/C30","v":377.50949436378323},{"$f":"B30*0.53*(0.6957*$C$2^-0.095)","v":37.656736891559689},{"$f":"D30*E30/1000","v":14.215775703322722}]
["Kastmismasin",81,null,{"$f":"D28","v":139.63828099690559},{"$f":"B31*0.5*(0.6957*$D$2^-0.088)","v":24.065767493526675},{"$f":"E31*D31/1000","v":3.3605024036672746}]

{"sheet":"GWP","index":3,"n_rows":579,"n_cols":7,"rows_kept":579,"cut":false,"hidden":false,"merged":[[570,5,570,6],[571,0,571,4],[571,5,571,6],[565,0,565,4],[567,0,567,4],[567,5,567,6],[568,0,568,4],[568,5,568,6],[20,7,96,21],[578,2,578,4],[578,5,578,6],[572,0,572,4],[572,5,572,6],[573,0,573,4],[573,5,573,6],[574,0,574,4],[574,5,574,6],[575,0,575,4],[575,5,575,6],[576,0,576,4],[576,5,576,6],[569,0,569,4],[569,5,569,6],[570,0,570,4]]}
[]
[]
[]
["Artikli nr","Makseartikli nimetus","Parameetrid","Mõõtühik","Maht","kg/CO2e","Kokku"]
[]
["KULUDE LOEND NR 1: ÜLDISED"]
["Artikli nr","Makseartikli nimetus","Parameetrid","Mõõtühik","Maht","Ühikhind","Maksumus"]
[10201,"Proovivõtt ja katsetamine ",null,"kogusumma  "]
[10202,"Load, kindlustused ",null,"kogusumma  "]
[10204,"Tööpiirkonna ja teede korrashoid  ",null,"kogusumma  "]
[10210,"Ajutised tööd (sh. objektikontorid, ajutised teed) ",null,"kogusumma  "]
[10211,"Tööde mõõdistamine ja märkimistööd ",null,"kogusumma  "]
[10212,"Konsultatsioonid projekteerijaga ",null,"kogusumma  "]
[10214,"Tööprojektide ja tööjooniste koostamine",null,"kogusumma  "]
[10215,"Muud tööd",null,"kogusumma  "]
[10216,"….."]
[]
[null,null,null,null,null,"Summa kantud kokkuvõttesse",{"$f":"SUM(G8:G17)","v":0}]
[]
["KULUDE LOEND NR 2: EHITUSOBJEKTI ETTEVALMISTAMINE"]
["Artikli nr","Makseartikli nimetus","Parameetrid","Mõõtühik","Maht","kg/CO2e","Kokku"]
[20101,"Ettevalmistustööd  ",null,"kogusumma  ",null,null,{"$f":"E22*F22","v":0}]
[20201,"Raadamine ja juurimine ",1,"m²",null,{"$f":"$F$75/100*C23","v":1.7000000000000001E-2},0]
[20202,"Raadamine, juurimine ja tee-maa-ala puhastamine  ",null,"kogusumma  ",null,null,0]
[20203,"Raadamine  ",null,"m2  ",null,null,0]
[20204,"Sanitaar- ja harvendusraie  ",null,"tk  ",null,null,0]
[20205,"Sanitaar- ja harvendusraie  ",null,"m2  ",null,null,0]
[20206,"Üksikpuude langetamine  ",null,"tk  ",null,null,0]
[20207,"Üksikpuude kändude juurimine (freesimine)  ",null,"tk  ",null,null,0]
[20208,"Üksikpuude langetamine koos kändude juurimisega (freesimisega)  ",null,"tk  ",null,null,0]
[20209,"Puude võra piiramine  ",null,"tk  ",null,null,0]
[20210,"Puude võra piiramine  ",null,"m2  ",null,null,0]
[20211,"Juurimine  ",1,"m²",null,{"$f":"$F$75/100*C33","v":1.7000000000000001E-2},0]
[20212,"Teemaa-ala puhastamine  ",null,"m2  ",null,null,0]
[20301,"Liiklusmärgi eemaldamine (koos postidega, vundamentidega jne.)  ",null,"tk  ",null,null,0]
[20302,"Tahvli eemaldamine (koos postidega, vundamentidega jne.)  ",null,"tk  ",null,null,0]
[20303,"Raamide eemaldamine  ",null,"tk  ",null,null,0]
[20304,"Konsoolide eemaldamine  ",null,"tk  ",null,null,0]
[20305,"Tähispostide eemaldamine  ",null,"tk  ",null,null,0]
[20306,"Truupide demonteerimine  ",null,"m  ",null,null,0]
[20307,"Sadevete äravoolutorude lammutamine  ",null,"m  ",null,null,0]
[20308,"Settekaevude lammutamine  ",null,"tk  ",null,null,0]
[20309,"Betoonist kontrollkaevu lammutamine  ",null,"tk  ",null,null,0]
[20310,"Truubi päiste lammutamine  ",null,"tk  ",null,null,0]
[20311,"Bussipeatuste lammutamine (koos ootekojaga, äärekivide, vundamendiga jne)  ",null,"tk  ",null,null,0]
[20312,"Liiklussaarte lammutamine (koos äärekivide, vundamentidega jne)  ",1,"m²",null,{"$f":"$F$75/100*C46","v":1.7000000000000001E-2},0]
[20313,"Äärekivide lammutamine  ",null,"m  ",null,null,0]
[20314,"Parkettkivikatte lammutamine  ",1,"m²",null,{"$f":"$F$75/100*C48","v":1.7000000000000001E-2},0]
[20315,"Hoonete lammutamine (koos vundamendiga)  ",null,"m3  ",null,null,0]
[20316,"Põrkepiirde eemaldamine (koos postidega)  ",null,"m  ",null,null,0]
[20317,"Torupiirde eemaldamine  ",null,"m  ",null,null,0]
[20318,"Konstruktsioonide lammutamine  ",null,"m3  ",null,null,0]
[20319,"Konstruktsioonide ümbertõstmine (kirjeldus)  ",null,"m3  ",null,null,0]
[20320,"Eriehitiste lammutamine (kirjeldus)  ",null,"m2  ",null,null,0]
[20321,"Võrkaia lammutamine (koos vundamendiga)  ",null,"m  ",null,null,0]
[20322,"Okastraataia lammutamine  ",null,"m  ",null,null,0]
[20323,"Aia ümbertõstmine (okastraat, võrk, jne)   ",null,"m  ",null,null,0]
[20324,"Õhuliini postide ümberpaigutamine  ",null,"tk  ",null,null,0]
[20325,"Konstruktsioonide ja teepäraldiste lammutamine, demonteerimine ja ümberpaigutamine  ",null,"kogusumma  ",null,null,0]
[20326,"Kattemärgistuse (värv) eemaldamine (kirjeldus)",1,"m2  ",null,{"$f":"0.04*C60","v":0.04},0]
{"$rows_left_out":520}
{"sheet":"Projekteerimise arvutus","index":4,"n_rows":456,"n_cols":9,"rows_kept":456,"cut":false,"hidden":false,"merged":[[101,0,101,1],[209,0,209,7],[174,0,174,1],[282,0,282,1],[11,0,11,1],[27,0,27,1],[245,0,245,7],[268,0,268,7],[184,0,184,7],[68,0,68,1],[231,0,231,1],[453,0,453,6],[377,0,377,7],[334,0,334,1],[407,0,407,1],[442,0,442,5],[336,0,336,7],[354,0,354,7]]}
[]
[]
[]
[null,null,"KULULOEND"]
[]
[null,null,"OBJEKT"]
[]
[]
[]
["          "]
["KULUTUSED Nr.1: ÜLDISED"]
["Artikli nr.",null,"Makseartikli nimetus","Parameetrid","Mõõtühik","Maht","kg/CO2e","t/CO2e"]
[1,2,3,4,5,6,7,8]
[]
[10201,null,"Proovivõtt ja katsetamine",null,"kogusumma",1]
[10202,null,"Load, kindlustused",null,"kogusumma",1]
[10204,null,"Tööpiirkonna ja teede korrashoid",null,"kogusumma",1]
[10210,null,"Ajutised tööd (sh. objektikontorid, ajutised teed)",null,"kogusumma",1]
[10211,null,"Tööde mõõdistamine ja märkimistööd",null,"kogusumma",1]
[10212,null,"Konsultatsioonid projekteerijaga",null,"kogusumma",1]
[10214,null,"Tööprojektide ja tööjooniste koostamine (sh kõik tehnilise kirjeldusega seotud projekteerimistööd)",null,"kogusumma",1]
[10215,null,"Muud tööd (sh muldkeha erimeede/erilahendus, monitoorimine (sh 5 aastat garantiiperioodil), muud tehnilise kirjeldusega seotud tööd)",null,"kogusumma",1]
[]
[null,null,null,null,null,null,"Kantud kokkuvõttesse"]
[]
[]
["KULUTUSED Nr. 2:  EHITUSOBJEKTI  ETTEVALMISTAMINE"]
["Artikli nr.",null,"Makseartikli nimetus","Parameetrid","Mõõtühik","Maht","kg/CO2e","t/CO2e"]
[1,2,3,4,5,6,7,8]
[]
[20101,null,"Ettevalmistustööd",null,"kogusumma",1]
[20201,"a","Juurimine",null,"m²",271823,{"$f":"_xlfn.XLOOKUP(A32,GWP!$A$22:$A$561,GWP!$F$22:$F$561)","v":1.7000000000000001E-2},{"$f":"F32*G32/1000","v":4.6209910000000001}]
[20203,null,"Raadamine",null,"m²",55000,{"$f":"_xlfn.XLOOKUP(A33,GWP!$A$22:$A$561,GWP!$F$22:$F$561)","v":0},{"$f":"F33*G33/1000","v":0}]
[20208,null,"Üksikpuude langetamine koos kändude juurimisega (freesimisega)",null,"tk",76,{"$f":"_xlfn.XLOOKUP(A34,GWP!$A$22:$A$561,GWP!$F$22:$F$561)","v":0},0]
[20212,"a","Teemaa-ala puhastamine",null,"m²",165530,{"$f":"_xlfn.XLOOKUP(A35,GWP!$A$22:$A$561,GWP!$F$22:$F$561)","v":0},0]
[20301,null,"Liiklusmärgi eemaldamine (koos postidega, vundamentidega jne.) ",null,"tk",105,{"$f":"_xlfn.XLOOKUP(A36,GWP!$A$22:$A$561,GWP!$F$22:$F$561)","v":0},0]
[20302,null,"Tahvli eemaldamine (koos postidega, vundamentidega jne.) ",null,"tk",40,{"$f":"_xlfn.XLOOKUP(A37,GWP!$A$22:$A$561,GWP!$F$22:$F$561)","v":0},0]
[20305,null,"Tähispostide eemaldamine",null,"tk",393,{"$f":"_xlfn.XLOOKUP(A38,GWP!$A$22:$A$561,GWP!$F$22:$F$561)","v":0},0]
[20306,"a","Truupide demonteerimine (betoon)"," dia = 200 mm","m",8,{"$f":"_xlfn.XLOOKUP(A39,GWP!$A$22:$A$561,GWP!$F$22:$F$561)","v":0},0]
[20306,"b","Truupide demonteerimine (betoon)"," dia = 500 mm","m",39,{"$f":"_xlfn.XLOOKUP(A40,GWP!$A$22:$A$561,GWP!$F$22:$F$561)","v":0},0]
[20306,"c","Truupide demonteerimine (betoon)"," dia = 600 mm","m",10,{"$f":"_xlfn.XLOOKUP(A41,GWP!$A$22:$A$561,GWP!$F$22:$F$561)","v":0},0]
[20306,"d","Truupide demonteerimine (betoon)"," dia = 1000 mm","m",38,{"$f":"_xlfn.XLOOKUP(A42,GWP!$A$22:$A$561,GWP!$F$22:$F$561)","v":0},0]
[20306,"e","Truupide demonteerimine (betoon)"," dia = 1600 mm","m",38,{"$f":"_xlfn.XLOOKUP(A43,GWP!$A$22:$A$561,GWP!$F$22:$F$561)","v":0},0]
[20306,"f","Truupide demonteerimine (plast)"," dia = 200 mm","m",8,{"$f":"_xlfn.XLOOKUP(A44,GWP!$A$22:$A$561,GWP!$F$22:$F$561)","v":0},0]
[20306,"g","Truupide demonteerimine (plast)"," dia = 400 mm","m",67,{"$f":"_xlfn.XLOOKUP(A45,GWP!$A$22:$A$561,GWP!$F$22:$F$561)","v":0},0]
[20306,"h","Truupide demonteerimine (plast)"," dia = 500 mm","m",10,{"$f":"_xlfn.XLOOKUP(A46,GWP!$A$22:$A$561,GWP!$F$22:$F$561)","v":0},0]
[20306,"i","Truupide demonteerimine (plast)"," dia = 600 mm","m",12,{"$f":"_xlfn.XLOOKUP(A47,GWP!$A$22:$A$561,GWP!$F$22:$F$561)","v":0},0]
[20306,"j","Truupide demonteerimine (plast)"," dia = 800 mm","m",52,{"$f":"_xlfn.XLOOKUP(A48,GWP!$A$22:$A$561,GWP!$F$22:$F$561)","v":0},0]
[20310,null,"Truubi päiste lammutamine",null,"tk",9,{"$f":"_xlfn.XLOOKUP(A49,GWP!$A$22:$A$561,GWP!$F$22:$F$561)","v":0},0]
[20311,null,"Bussipeatuste lammutamine (koos ootekojaga, äärekivide, vundamendiga jne) ",null,"tk",4,{"$f":"_xlfn.XLOOKUP(A50,GWP!$A$22:$A$561,GWP!$F$22:$F$561)","v":0},0]
[20313,null,"Äärekivide lammutamine",null,"m",255,{"$f":"_xlfn.XLOOKUP(A51,GWP!$A$22:$A$561,GWP!$F$22:$F$561)","v":0},0]
[20315,"a","Hoonete lammutamine (koos vundamendiga) Pk 772+85 paremal"," 10 - 20 m³","tk",1,{"$f":"_xlfn.XLOOKUP(A52,GWP!$A$22:$A$561,GWP!$F$22:$F$561)","v":0},0]
[20315,"b","Hoonete lammutamine (koos vundamendiga) Pk 711+00 paremal"," 20 - 50 m³","tk",1,{"$f":"_xlfn.XLOOKUP(A53,GWP!$A$22:$A$561,GWP!$F$22:$F$561)","v":0},0]
[20315,"c","Hoonete lammutamine (koos vundamendiga) PK 773+00 paremal"," 20 - 50 m³","tk",1,{"$f":"_xlfn.XLOOKUP(A54,GWP!$A$22:$A$561,GWP!$F$22:$F$561)","v":0},0]
[20316,null,"Põrkepiirde eemaldamine (koos postidega) ",null,"m",1643,{"$f":"_xlfn.XLOOKUP(A55,GWP!$A$22:$A$561,GWP!$F$22:$F$561)","v":0},0]
[20317,null,"Torupiirde eemaldamine",null,"m",197,{"$f":"_xlfn.XLOOKUP(A56,GWP!$A$22:$A$561,GWP!$F$22:$F$561)","v":0},0]
[20319,null,"Kivide ümbertõstmine pk 702+00-711+50 paremal",null,"tk",6,{"$f":"_xlfn.XLOOKUP(A57,GWP!$A$22:$A$561,GWP!$F$22:$F$561)","v":0},0]
[20320,null,"Eriehitiste lammutamine (kiviaiad pk 706+00 vasakul, pk 706+75 vasakul ning tee 121 pk 2+35 vasakul) ",null,"m",38,{"$f":"_xlfn.XLOOKUP(A58,GWP!$A$22:$A$561,GWP!$F$22:$F$561)","v":0},0]
[20320,null,"Eriehitiste lammutamine (väikevormid või -elemendid) ",null,"tk",14,{"$f":"_xlfn.XLOOKUP(A59,GWP!$A$22:$A$561,GWP!$F$22:$F$561)","v":0},0]
[20321,null,"Võrkaia lammutamine (koos vundamendiga) (Möldri kinnistu vasakul)",null,"m",27,{"$f":"_xlfn.XLOOKUP(A60,GWP!$A$22:$A$561,GWP!$F$22:$F$561)","v":0},0]
{"$rows_left_out":396}